ffmpeg woe

d.stab_git …
not doing git get latest pull for latest code libmysofa_git
doing git checkout origin/master
HEAD is now at 5c238dc cosmetics on code coverage
fetched no code changes, not forcing reconfigure for that…

Making /home/joshua/dev/ffmpeg-windows-build-helpers/sandbox/win64/libmysofa_git as $ PATH=/home/joshua/dev/ffmpeg-windows-build-helpers/sandbox/cross_compilers/mingw-w64-x86_64/bin:$PATH make -j 4

[ 4%] Building C object src/CMakeFiles/mysofa-static.dir/hdf/dataobject.c.obj
[ 9%] Building C object src/CMakeFiles/mysofa-static.dir/hrtf/reader.c.obj
[ 14%] Building C object src/CMakeFiles/mysofa-static.dir/hdf/superblock.c.obj
[ 19%] Building C object src/CMakeFiles/mysofa-static.dir/hdf/btree.c.obj
In file included from /home/joshua/dev/ffmpeg-windows-build-helpers/sandbox/win64/libmysofa_git/src/hdf/../hrtf/mysofa.h:14:0,
from /home/joshua/dev/ffmpeg-windows-build-helpers/sandbox/win64/libmysofa_git/src/hdf/reader.h:10,
from /home/joshua/dev/ffmpeg-windows-build-helpers/sandbox/win64/libmysofa_git/src/hdf/dataobject.c:15:
/usr/include/stdint.h:26:10: fatal error: bits/libc-header-start.h: No such file or directory
#include <bits/libc-header-start.h>
^~~~~~~~~~~~~~~~~~~~~~~~~~
compilation terminated.
In file included from /home/joshua/dev/ffmpeg-windows-build-helpers/sandbox/win64/libmysofa_git/src/hdf/../hrtf/mysofa.h:14:0,
from /home/joshua/dev/ffmpeg-windows-build-helpers/sandbox/win64/libmysofa_git/src/hdf/reader.h:10,
from /home/joshua/dev/ffmpeg-windows-build-helpers/sandbox/win64/libmysofa_git/src/hdf/superblock.c:7:
/usr/include/stdint.h:26:10: fatal error: bits/libc-header-start.h: No such file or directory
#include <bits/libc-header-start.h>
^~~~~~~~~~~~~~~~~~~~~~~~~~
compilation terminated.
make[2]: *** [src/CMakeFiles/mysofa-static.dir/build.make:92: src/CMakeFiles/mysofa-static.dir/hdf/dataobject.c.obj] Error 1
make[2]: *** Waiting for unfinished jobs….
make[2]: *** [src/CMakeFiles/mysofa-static.dir/build.make:78: src/CMakeFiles/mysofa-static.dir/hdf/superblock.c.obj] Error 1
In file included from /usr/include/ctype.h:25:0,
from /home/joshua/dev/ffmpeg-windows-build-helpers/sandbox/win64/libmysofa_git/src/hrtf/reader.c:7:
/usr/include/features.h:470:10: fatal error: gnu/stubs.h: No such file or directory
#include <gnu/stubs.h>
^~~~~~~~~~~~~
compilation terminated.
make[2]: *** [src/CMakeFiles/mysofa-static.dir/build.make:64: src/CMakeFiles/mysofa-static.dir/hrtf/reader.c.obj] Error 1
In file included from /home/joshua/dev/ffmpeg-windows-build-helpers/sandbox/win64/libmysofa_git/src/hdf/../hrtf/mysofa.h:14:0,
from /home/joshua/dev/ffmpeg-windows-build-helpers/sandbox/win64/libmysofa_git/src/hdf/reader.h:10,
from /home/joshua/dev/ffmpeg-windows-build-helpers/sandbox/win64/libmysofa_git/src/hdf/btree.c:7:
/usr/include/stdint.h:26:10: fatal error: bits/libc-header-start.h: No such file or directory
#include <bits/libc-header-start.h>
^~~~~~~~~~~~~~~~~~~~~~~~~~
compilation terminated.
make[2]: *** [src/CMakeFiles/mysofa-static.dir/build.make:106: src/CMakeFiles/mysofa-static.dir/hdf/btree.c.obj] Error 1
make[1]: *** [CMakeFiles/Makefile2:91: src/CMakeFiles/mysofa-static.dir/all] Error 2
make: *** [Makefile:152: all] Error 2

 

meant “nuke it and try again”?

One thought on “ffmpeg woe”

  1. collect2: error: ld returned 1 exit status
    make[1]: *** [../../source/gcc-8.3.0/gcc/cp/Make-lang.in:120: cc1plus] Error 1
    make[1]: *** Waiting for unfinished jobs….
    collect2: error: ld returned 1 exit status
    make[1]: *** [../../source/gcc-8.3.0/gcc/lto/Make-lang.in:81: lto1] Error 1
    rm gcc.pod
    make[1]: Leaving directory ‘/home/joshua/dev/ffmpeg-windows-build-helpers/sandbox/cross_compilers/pkgs/gcc/build/gcc’
    make: *** [Makefile:4266: all-gcc] Error 2
    error

    meant “out of disk space”

    CDPATH=”${ZSH_VERSION+.}:” && cd . && /bin/bash /home/joshua/dev/ffmpeg-windows-build-helpers/sandbox/win32/xz-5.2.3/build-aux/missing aclocal-1.15 -I m4
    /home/joshua/dev/ffmpeg-windows-build-helpers/sandbox/win32/xz-5.2.3/build-aux/missing: line 81: aclocal-1.15: command not found
    WARNING: ‘aclocal-1.15’ is missing on your system.
    You should only need it if you modified ‘acinclude.m4’ or
    ‘configure.ac’ or m4 files included by ‘configure.ac’.
    The ‘aclocal’ program is part of the GNU Automake package:
    <http://www.gnu.org/software/automake>
    It also requires GNU Autoconf, GNU m4 and Perl in order to run:
    <http://www.gnu.org/software/autoconf>
    <http://www.gnu.org/software/m4/>
    <http://www.perl.org/>
    make: *** [Makefile:514: aclocal.m4] Error 127

    meant “nuke and rebuild that thing” I had copied it from 64 bit to 32 bit

Leave a Reply

Your email address will not be published. Required fields are marked *

Time limit is exhausted. Please reload the CAPTCHA.