bbcp woe

packrd@gmvl011.a|dpsprod:~/bbcp/src$ make

make[1]: Entering directory `/home/packrd/bbcp/src’

make[2]: Entering directory `/home/packrd/bbcp/src’

make[3]: Entering directory `/home/packrd/bbcp/src’

Compiling bbcp.C

Compiling bbcp_Args.C

Compiling bbcp_BuffPool.C

Compiling bbcp_C32.C

Compiling bbcp_C32C.C

Compiling bbcp_C32_Zip.C

Compiling bbcp_ChkSum.C

In file included from bbcp_ChkSum.C:37:

bbcp_MD5_openssl.h:53:25: error: openssl/md5.h: No such file or directory

In file included from bbcp_ChkSum.C:37:

bbcp_MD5_openssl.h:103: error: ‘MD5_CTX’ does not name a type

bbcp_MD5_openssl.h:107: error: ‘MD5_CTX’ has not been declared

bbcp_MD5_openssl.h:108: error: ‘MD5_CTX’ has not been declared

bbcp_MD5_openssl.h:110: error: ‘MD5_CTX’ has not been declared

bbcp_MD5_openssl.h: In member function ‘int bbcp_MD5_openssl::Chk_MD5(char*, int, char*)’:

bbcp_MD5_openssl.h:61: error: ‘MyContext’ was not declared in this scope

bbcp_MD5_openssl.h: In member function ‘void bbcp_MD5_openssl::Set_MD5(char*, int, char*)’:

bbcp_MD5_openssl.h:69: error: ‘MyContext’ was not declared in this scope

bbcp_MD5_openssl.h: In member function ‘virtual char* bbcp_MD5_openssl::csCurr(char**)’:

bbcp_MD5_openssl.h:75: error: ‘MD5_CTX’ was not declared in this scope

bbcp_MD5_openssl.h:75: error: expected ‘;’ before ‘currCTX’

bbcp_MD5_openssl.h:76: error: ‘currCTX’ was not declared in this scope

bbcp_MD5_openssl.h: In member function ‘virtual void bbcp_MD5_openssl::Init()’:

bbcp_MD5_openssl.h:85: error: ‘MyContext’ was not declared in this scope

bbcp_MD5_openssl.h: In member function ‘virtual void bbcp_MD5_openssl::Update(const char*, int)’:

bbcp_MD5_openssl.h:88: error: ‘MyContext’ was not declared in this scope

bbcp_MD5_openssl.h: In member function ‘virtual char* bbcp_MD5_openssl::Final(char**)’:

bbcp_MD5_openssl.h:91: error: ‘MyContext’ was not declared in this scope

bbcp_MD5_openssl.h: In constructor ‘bbcp_MD5_openssl::bbcp_MD5_openssl()’:

bbcp_MD5_openssl.h:98: error: ‘MyContext’ was not declared in this scope

make[3]: *** [../obj/amd64_linux26/bbcp_ChkSum.o] Error 1

make[3]: Leaving directory `/home/packrd/bbcp/src’

make[2]: *** [makeLinuxx86_64] Error 2

make[2]: Leaving directory `/home/packrd/bbcp/src’

make[1]: *** [Linux] Error 2

 

meant (centos) install “openssl-devel package”

Leave a Reply

Your email address will not be published. Required fields are marked *

Time limit is exhausted. Please reload the CAPTCHA.