ffmpeg cross woe

nice: cannot set niceness: Permission denied
cd . && /bin/bash /home/rdp/ffmpeg-windows-build-helpers/sandbox/win32/mfx_dispatch_git/missing automake-1.15 –foreign
configure.ac:48: error: required file ‘./compile’ not found
configure.ac:48: ‘automake –add-missing’ can install ‘compile’
Makefile:480: recipe for target ‘Makefile.in’ failed
make: *** [Makefile.in] Error 1

 

meant “nuke that mfx_dispatch_git folder and start over” (then it worked…hrm…)

2 thoughts on “ffmpeg cross woe”

  1. depbase=`echo basedir.lo | sed ‘s|[^/]*$|.deps/&|;s|\.lo$||’`;\
    /bin/bash ../libtool –tag=CXX –mode=compile i686-w64-mingw32-g++ -DHAVE_CONFIG_H -I. -I.. -DUSE_STD_NAMESPACE -DWINDLLNAME=\”libtesseract\” -I/home/rdp/ffmpeg-windows-build-helpers/sandbox/cross_compilers/mingw-w64-i686/i686-w64-mingw32/include/leptonica -DTESSDATA_PREFIX=/home/rdp/ffmpeg-windows-build-helpers/sandbox/cross_compilers/mingw-w64-i686/i686-w64-mingw32/share/ -g -O2 -std=c++11 -MT basedir.lo -MD -MP -MF $depbase.Tpo -c -o basedir.lo basedir.cpp &&\
    mv -f $depbase.Tpo $depbase.Plo
    make[3]: *** No rule to make target ‘bits16.cpp’, needed by ‘bits16.lo’. Stop.
    make[3]: *** Waiting for unfinished jobs….
    libtool: compile: i686-w64-mingw32-g++ -DHAVE_CONFIG_H -I. -I.. -DUSE_STD_NAMESPACE -DWINDLLNAME=\”libtesseract\” -I/home/rdp/ffmpeg-windows-build-helpers/sandbox/cross_compilers/mingw-w64-i686/i686-w64-mingw32/include/leptonica -DTESSDATA_PREFIX=/home/rdp/ffmpeg-windows-build-helpers/sandbox/cross_compilers/mingw-w64-i686/i686-w64-mingw32/share/ -g -O2 -std=c++11 -MT ambigs.lo -MD -MP -MF .deps/ambigs.Tpo -c ambigs.cpp -o ambigs.o
    libtool: compile: i686-w64-mingw32-g++ -DHAVE_CONFIG_H -I. -I.. -DUSE_STD_NAMESPACE -DWINDLLNAME=\”libtesseract\” -I/home/rdp/ffmpeg-windows-build-helpers/sandbox/cross_compilers/mingw-w64-i686/i686-w64-mingw32/include/leptonica -DTESSDATA_PREFIX=/home/rdp/ffmpeg-windows-build-helpers/sandbox/cross_compilers/mingw-w64-i686/i686-w64-mingw32/share/ -g -O2 -std=c++11 -MT basedir.lo -MD -MP -MF .deps/basedir.Tpo -c basedir.cpp -o basedir.o
    make[3]: Leaving directory ‘/home/rdp/ffmpeg-windows-build-helpers/sandbox/win32/tesseract_git/ccutil’
    Makefile:570: recipe for target ‘all-recursive’ failed
    make[2]: *** [all-recursive] Error 1
    make[2]: Leaving directory ‘/home/rdp/ffmpeg-windows-build-helpers/sandbox/win32/tesseract_git/ccutil’
    Makefile:492: recipe for target ‘all-recursive’ failed
    make[1]: *** [all-recursive] Error 1
    make[1]: Leaving directory ‘/home/rdp/ffmpeg-windows-build-helpers/sandbox/win32/tesseract_git’
    Makefile:401: recipe for target ‘all’ failed
    make: *** [all] Error 2

    meant “appears those guys introduced a bug”

    commit 2cc46fa6d456f9b49bc8a70036fa989a9c3baf50
    Author: Stefan Weil
    Date: Wed Mar 28 10:02:37 2018 +0200

    BITS16: Use inline code for all constructors (#1434)

    Signed-off-by: Stefan Weil

    diff –git a/ccutil/Makefile.am b/ccutil/Makefile.am
    index 6912dcc..032df1d 100644
    — a/ccutil/Makefile.am
    +++ b/ccutil/Makefile.am
    @@ -27,7 +27,7 @@ noinst_HEADERS = \
    noinst_LTLIBRARIES = libtesseract_ccutil.la

    libtesseract_ccutil_la_SOURCES = \
    – ambigs.cpp basedir.cpp bits16.cpp bitvector.cpp \
    + ambigs.cpp basedir.cpp bitvector.cpp \
    ccutil.cpp clst.cpp \

Leave a Reply

Your email address will not be published. Required fields are marked *

Time limit is exhausted. Please reload the CAPTCHA.